{"text_format":"1","workbook":"xlsx","n_sheets":5,"sheets":["DATA","User Instructions","DATA ENTRY","FORM","Changes"],"not_rendered":{"charts":0,"images":6,"macros":1,"external_links":0,"defined_names":59,"comments":2,"pivot_tables":0},"unopened":[],"bounds":{"document_bytes":16777216,"sheet_cells":100000,"rows_first":2000,"rows_last":500,"rows_between":2000,"halvings":0,"cell_chars":16384,"cell_head_chars":4096},"cells_cut":0,"cells_raw":0,"read":"whole","date_system":"1900"}

{"sheet":"DATA","index":0,"n_rows":317,"n_cols":181,"rows_kept":317,"cut":false,"hidden":true,"merged":[[8,42,15,45]]}
[null,null,null,null,null,null,null,null,null,null,null,null,1,"Select your first remittance date >",null,null,null,null,null,null,null,null,1,2,3,4,5,{"$f":"+AA1+1","v":6},{"$f":"+AB1+1","v":7},8,9,10,11,12,null,null,null,null,null,null,null,null,1,null,null,null,null,1,{"$f":"+AV1+1","v":2},{"$f":"+AW1+1","v":3},4,5,6,{"$f":"+BA1+1","v":7},{"$f":"+BB1+1","v":8},{"$f":"+BC1+1","v":9},{"$f":"+BD1+1","v":10},{"$f":"+BE1+1","v":11},{"$f":"+BF1+1","v":12},{"$f":"+BG1+1","v":13},{"$f":"+BH1+1","v":14},{"$f":"+BI1+1","v":15},{"$f":"+BJ1+1","v":16},{"$f":"+BK1+1","v":17},{"$f":"+BL1+1","v":18},{"$f":"+BM1+1","v":19},{"$f":"+BN1+1","v":20},{"$f":"+BO1+1","v":21},{"$f":"+BP1+1","v":22},{"$f":"+BQ1+1","v":23},{"$f":"+BR1+1","v":24},{"$f":"+BS1+1","v":25},{"$f":"+BT1+1","v":26},{"$f":"+BU1+1","v":27},{"$f":"+BV1+1","v":28},{"$f":"+BW1+1","v":29},{"$f":"+BX1+1","v":30},{"$f":"+BY1+1","v":31},{"$f":"+BZ1+1","v":32},{"$f":"+CA1+1","v":33},{"$f":"+CB1+1","v":34},{"$f":"+CC1+1","v":35},{"$f":"+CD1+1","v":36},{"$f":"+CE1+1","v":37},{"$f":"+CF1+1","v":38},{"$f":"+CG1+1","v":39},{"$f":"+CH1+1","v":40},{"$f":"+CI1+1","v":41},{"$f":"+CJ1+1","v":42},{"$f":"+CK1+1","v":43},{"$f":"+CL1+1","v":44},{"$f":"+CM1+1","v":45},{"$f":"+CN1+1","v":46},{"$f":"+CO1+1","v":47},{"$f":"+CP1+1","v":48},{"$f":"+CQ1+1","v":49},{"$f":"+CR1+1","v":50},{"$f":"+CS1+1","v":51},{"$f":"+CT1+1","v":52},{"$f":"+CU1+1","v":53},{"$f":"+CV1+1","v":54},{"$f":"+CW1+1","v":55},{"$f":"+CX1+1","v":56},{"$f":"+CY1+1","v":57},{"$f":"+CZ1+1","v":58},{"$f":"+DA1+1","v":59},{"$f":"+DB1+1","v":60},{"$f":"+DC1+1","v":61},{"$f":"+DD1+1","v":62},{"$f":"+DE1+1","v":63},{"$f":"+DF1+1","v":64},{"$f":"+DG1+1","v":65},{"$f":"+DH1+1","v":66},{"$f":"+DI1+1","v":67},{"$f":"+DJ1+1","v":68},{"$f":"+DK1+1","v":69},{"$f":"+DL1+1","v":70},{"$f":"+DM1+1","v":71},{"$f":"+DN1+1","v":72},{"$f":"+DO1+1","v":73},{"$f":"+DP1+1","v":74},{"$f":"+DQ1+1","v":75},{"$f":"+DR1+1","v":76},{"$f":"+DS1+1","v":77},{"$f":"+DT1+1","v":78},{"$f":"+DU1+1","v":79},{"$f":"+DV1+1","v":80},{"$f":"+DW1+1","v":81},{"$f":"+DX1+1","v":82},{"$f":"+DY1+1","v":83},{"$f":"+DZ1+1","v":84},{"$f":"+EA1+1","v":85},{"$f":"+EB1+1","v":86},{"$f":"+EC1+1","v":87},{"$f":"+ED1+1","v":88},{"$f":"+EE1+1","v":89},{"$f":"+EF1+1","v":90},{"$f":"+EG1+1","v":91},{"$f":"+EH1+1","v":92},{"$f":"+EI1+1","v":93},{"$f":"+EJ1+1","v":94},{"$f":"+EK1+1","v":95},{"$f":"+EL1+1","v":96},{"$f":"+EM1+1","v":97},{"$f":"+EN1+1","v":98},{"$f":"+EO1+1","v":99},{"$f":"+EP1+1","v":100},{"$f":"+EQ1+1","v":101},{"$f":"+ER1+1","v":102},{"$f":"+ES1+1","v":103},{"$f":"+ET1+1","v":104},{"$f":"+EU1+1","v":105},{"$f":"+EV1+1","v":106},{"$f":"+EW1+1","v":107},{"$f":"+EX1+1","v":108},{"$f":"+EY1+1","v":109},{"$f":"+EZ1+1","v":110},{"$f":"+FA1+1","v":111},{"$f":"+FB1+1","v":112},{"$f":"+FC1+1","v":113},{"$f":"+FD1+1","v":114},{"$f":"+FE1+1","v":115},{"$f":"+FF1+1","v":116},{"$f":"+FG1+1","v":117},{"$f":"+FH1+1","v":118},{"$f":"+FI1+1","v":119},{"$f":"+FJ1+1","v":120},{"$f":"+FK1+1","v":121},{"$f":"+FL1+1","v":122},{"$f":"+FM1+1","v":123},{"$f":"+FN1+1","v":124},{"$f":"+FO1+1","v":125}]
[null,"Mun tax Due Dates","https://www.gov.mb.ca/asset_library/en/newslinks/2021/06/BKG-Education_Property_Tax_Rebate-FIN.pdf",null,null,null,null,null,null,null,null,null,null,null,null,null,null,null,null,null,null,null,null,null,null,null,null,null,null,null,null,null,null,null,null,null,null,null,null,null,null,null,null,null,null,null,"Source: ","\\\\ME\\edu\\114eduWGP\\Edusfb\\Frame\\SpecLevy\\Form2\\2024\\LINKS_MUN_FORM2 - 2024.xlsm"]
[null,null,null,null,null,null,null,null,null,null,null,null,null,null,null,null,null,null,null,null,null,null,null,null,null,null,null,null,null,null,null,null,null,null,null,null,null,null,null,null,null,null,null,null,null,null,"NOTE: Source file should be updated with budget year numbers, and renamed to corresponding year"]
[null,null,null,null,null,null,null,null,null,null,null,null,null,null,null,null,null,null,null,null,null,null,null,null,null,null,null,null,null,null,null,null,null,null,null,null,null,null,null,null,null,null,"English",null,null,null,null,null,null,null,null,null,"Special Levy"]
[null,null,1,"Press arrow for your School Division >","No.",null,"DIVNUM_MUN","MUN","DUE",null,null,null,null,null,null,null,null,null,null,null,null,null,null,null,null,null,null,null,null,null,null,null,null,null,null,null,null,null,null,null,null,null,"French",null,null,null,null,null,null,"Special Levy","Special Levy","Special Levy","Before","Previous Year",null,null,null,null,"Total"]
["DIVNUM",1,2,"BEAUTIFUL PLAINS","BE",{"$f":"COUNTIF($G$6:$G$273,E6)","v":10},"BE","rm of elton","Oct 29",null,"DATENUM",2,2,"Provincial Funding",null,null,null,null,null,null,null,null,{"$f":"+'DATA ENTRY'!G33","v":"REMITTANCE 1"},{"$f":"+'DATA ENTRY'!H33","v":"REMITTANCE 2"},{"$f":"+'DATA ENTRY'!I33","v":"REMITTANCE 3"},{"$f":"+'DATA ENTRY'!J33","v":"REMITTANCE 4"},{"$f":"+'DATA ENTRY'!K33","v":"REMITTANCE 5"},{"$f":"+'DATA ENTRY'!L33","v":"REMITTANCE 6"},{"$f":"+'DATA ENTRY'!M33","v":"REMITTANCE 7"},{"$f":"+'DATA ENTRY'!N33","v":"REMITTANCE 8"},{"$f":"+'DATA ENTRY'!O33","v":"REMITTANCE 9"},{"$f":"+'DATA ENTRY'!P33","v":"REMITTANCE 10"},{"$f":"+'DATA ENTRY'!Q33","v":"REMITTANCE 11"},{"$f":"+'DATA ENTRY'!R33","v":"REMITTANCE 12"},{"$f":"IF(ISERROR(HLOOKUP(AI7,W1:AH7,3,0)=TRUE),0,(HLOOKUP(AI7,W1:AH7,3,0)))","v":0},null,null,null,null,null,null,null,null,null,null,null,null,80,null,"for the SD","for DSFM","Adj for DSFM","TIG & PTOG","TIG ADJ","TIG","TIG by divison","PTOG by division","DSFM PTOG","Special Levy",null,"Municipalities","NO DSFM"]
[null,null,3,"BORDER LAND","BO",{"$f":"COUNTIF($G$6:$G$273,E7)","v":9},"BE","municipality of glenella-lansdowne","Oct 31",null,null,null,3,"Jul 31",null,null,null,null,null,null,null,null,{"$f":"+'DATA ENTRY'!G34","v":0},{"$f":"+'DATA ENTRY'!H34","v":0},{"$f":"+'DATA ENTRY'!I34","v":0},{"$f":"+'DATA ENTRY'!J34","v":0},{"$f":"+'DATA ENTRY'!K34","v":0},{"$f":"+'DATA ENTRY'!L34","v":0},{"$f":"+'DATA ENTRY'!M34","v":0},{"$f":"+'DATA ENTRY'!N34","v":0},{"$f":"+'DATA ENTRY'!O34","v":0},{"$f":"+'DATA ENTRY'!P34","v":0},{"$f":"+'DATA ENTRY'!Q34","v":0},{"$f":"+'DATA ENTRY'!R34","v":0},{"$f":"+MAX(AI8:AI33)","v":0},null,null,null,null,1,null,null,null,null,null,null,null,"CO. ","DIVISION/DISTRICT","SPLEVDIV","SPLEVDSFM","SLADJLT","G17","G18","TIGSL2","TIG","TOG",null,"SPLEVLT",null,1,{"$f":"+BI7+1","v":2},{"$f":"+BJ7+1","v":3},4,5,6,7,8,9,10,11,12,13,14,15,16,17,18,19,20,21,22,23,24,25,26,27,28,29,30,31,32,33,34,35,36,37,38,39,40,41,42,43,44,45,46,47,48,49,50,51,52,53,54,55,1,{"$f":"+DL7+1","v":2},{"$f":"+DM7+1","v":3},4,5,6,7,8,9,10,11,12,13,14,15,16,17,18,19,20,21,22,23,{"$f":"+EH7+1","v":24},25,26,27,28,29,30,31,32,33,34,35,36,37,38,39,40,41,42,43,44,45,46,47,48,49,50,51,52,53,54,55,"Ratios Page","PTOG DIV ",null,"DSFM","Control"]
["DIVNUM2",{"$f":"VLOOKUP(B6,C1:E57,3)","v":"No."},4,"BRANDON","BR",9,"BE","municipality of north cypress-langford","Sep 30",null,"DATENUM2",{"$f":"IF(OR(DATENUM=1,DATENUM=2),\"\",VLOOKUP(L6,M1:N8,2))","v":""},4,"Oct 31",null,null,null,null,null,6,null,{"$f":"+'DATA ENTRY'!A35","v":0},{"$f":"IF('DATA ENTRY'!G35=\"\",0,1)","v":0},{"$f":"IF('DATA ENTRY'!H35=\"\",0,2)","v":0},{"$f":"IF('DATA ENTRY'!I35=\"\",0,3)","v":0},{"$f":"IF('DATA ENTRY'!J35=\"\",0,4)","v":0},{"$f":"IF('DATA ENTRY'!K35=\"\",0,AA1)","v":0},{"$f":"IF('DATA ENTRY'!L35=\"\",0,AB1)","v":0},{"$f":"IF('DATA ENTRY'!M35=\"\",0,AC1)","v":0},{"$f":"IF('DATA ENTRY'!N35=\"\",0,AD1)","v":0},{"$f":"IF('DATA ENTRY'!O35=\"\",0,AE1)","v":0},{"$f":"IF('DATA ENTRY'!P35=\"\",0,AF1)","v":0},{"$f":"IF('DATA ENTRY'!Q35=\"\",0,AG1)","v":0},{"$f":"IF('DATA ENTRY'!R35=\"\",0,AH1)","v":0},{"$f":"MAX(W8:AH8)","v":0},{"$f":"HLOOKUP($AI$7,'DATA ENTRY'!$G$16:$R$60,T8,0)","v":{"$error":"#N/A"}},{"$f":"+V8","v":0},null,null,{"$f":"+AN7+1","v":2},null,null,null,null,null,null,null,null,null,null,null,null,null,null,null,null,null,null,null,null,null,null,null,null,null,null,null,null,null,null,null,null,null,null,null,null,null,null,null,null,null,null,null,null,null,null,null,null,null,null,null,null,null,null,null,null,null,null,null,null,null,null,null,null,null,null,null,null,null,null,null,null,null,null,null,null,null,null,null,null,null,null,null,null,null,null,null,null,null,null,null,null,null,null,null,null,null,null,null,null,null,null,null,null,null,null,null,null,null,null,null,null,null,null,null,null,null,null,null,null,null,null,null,null,null,null,null,null,null,null,null,null,null,null,null,null,null,null,null,null,"TOTAL Sp. Levy - L"]
[null,null,5,"EVERGREEN","EV",9,"BE","municipality of north norfolk","Sep 30",null,null,null,null,null,null,null,null,null,null,{"$f":"+T8+1","v":7},null,{"$f":"+'DATA ENTRY'!A36","v":0},{"$f":"IF('DATA ENTRY'!G36=\"\",0,1)","v":0},{"$f":"IF('DATA ENTRY'!H36=\"\",0,2)","v":0},{"$f":"IF('DATA ENTRY'!I36=\"\",0,3)","v":0},{"$f":"IF('DATA ENTRY'!J36=\"\",0,4)","v":0},{"$f":"IF('DATA ENTRY'!K36=\"\",0,AA1)","v":0},{"$f":"IF('DATA ENTRY'!L36=\"\",0,AB1)","v":0},{"$f":"IF('DATA ENTRY'!M36=\"\",0,AC1)","v":0},{"$f":"IF('DATA ENTRY'!N36=\"\",0,AD1)","v":0},{"$f":"IF('DATA ENTRY'!O36=\"\",0,AE1)","v":0},{"$f":"IF('DATA ENTRY'!P36=\"\",0,AF1)","v":0},{"$f":"IF('DATA ENTRY'!Q36=\"\",0,AG1)","v":0},{"$f":"IF('DATA ENTRY'!R36=\"\",0,AH1)","v":0},0,{"$f":"IF(HLOOKUP($AI$7,'DATA ENTRY'!$G$16:$R$60,T9,0)=\"\",0,HLOOKUP($AI$7,'DATA ENTRY'!$G$16:$R$60,T9,0))","v":{"$error":"#N/A"}},{"$f":"+V9","v":0},null,null,{"$f":"+AN8+1","v":3},null,null,"Important !!!!!!!!!:\nBefore post the form 2, send the ratios for the current year to the Manitoba Tax Assistance Office - so they can send the right amount to the Divisions, for the split between the Divisions share and DSFM.",null,null,null,"W/O","BE","BEAUTIFUL PLAINS",null,null,null,11009365,null,252166,252166,596979,null,10160220,null,"RM OF ELTON (124)","MUNICIPALITY OF GLENELLA-LANSDOWNE (142)","MUNICIPALITY OF NORTH CYPRESS-LANGFORD (155)","MUNICIPALITY OF NORTH NORFOLK (156)","RM OF MINTO-ODANAH (159)","RM OF ROSEDALE (170)","MUNICIPALITY OF GLENBORO-SOUTH CYPRESS (187)","RM OF VICTORIA (197)","TOWN OF CARBERRY (407)","TOWN OF NEEPAWA (437)",0,0,0,0,0,0,0,0,0,0,0,0,0,null,null,null,null,null,null,null,null,null,null,null,null,null,null,null,null,null,null,null,null,null,null,null,null,null,null,null,null,null,null,null,null,146704,787349,5039340,8591,70903,1090147,8409,3066,788171,2217541,0,0,0,0,0,0,0,0,0,0,0,0,null,null,null,null,null,null,null,null,null,null,null,null,null,null,null,null,null,null,null,null,null,null,null,null,null,null,null,null,null,null,null,null,null,{"$f":"+BG9-SUM(DL9:FN9)","v":-1},596979,{"$f":"+AV9","v":"BE"},"No DSFM",{"$f":"IF(AND(FO9=0,FR9=\"No DSFM\"),0,AY9-SUM(DL9:EH9))","v":-10160221},{"$f":"+AY9-SUM(DL9:EH9)","v":-10160221},{"$f":"+AV9","v":"BE"},null,null,null,{"$f":"SUM(AY9:AY45)","v":39175773}]
[null,null,6,"FLIN FLON","FL",1,"BE","rm of minto-odanah","Oct 29",null,"DATE_ON_OFF",2,null,null,null,null,null,null,null,{"$f":"+T9+1","v":8},1,{"$f":"+'DATA ENTRY'!A37","v":""},{"$f":"IF('DATA ENTRY'!G37=\"\",0,1)","v":0},{"$f":"IF('DATA ENTRY'!H37=\"\",0,2)","v":0},{"$f":"IF('DATA ENTRY'!I37=\"\",0,3)","v":0},{"$f":"IF('DATA ENTRY'!J37=\"\",0,4)","v":0},{"$f":"IF('DATA ENTRY'!K37=\"\",0,AA1)","v":0},{"$f":"IF('DATA ENTRY'!L37=\"\",0,AB1)","v":0},{"$f":"IF('DATA ENTRY'!M37=\"\",0,AC1)","v":0},{"$f":"IF('DATA ENTRY'!N37=\"\",0,AD1)","v":0},{"$f":"IF('DATA ENTRY'!O37=\"\",0,AE1)","v":0},{"$f":"IF('DATA ENTRY'!P37=\"\",0,AF1)","v":0},{"$f":"IF('DATA ENTRY'!Q37=\"\",0,AG1)","v":0},{"$f":"IF('DATA ENTRY'!R37=\"\",0,AH1)","v":0},0,{"$f":"HLOOKUP($AI$7,'DATA ENTRY'!$G$16:$R$60,T10,0)","v":{"$error":"#N/A"}},"",null,null,4,null,null,null,null,null,null,null,"BO","BORDER LAND",19409211,100770,0,19509981,0,2575999,2562850,1109209,-12268,15837041,null,"RM OF DE SALABERRY (119)","MUNICIPALITY OF EMERSON-FRANKLIN (127)","RM OF LA BROQUERIE (138)","RM OF MONTCALM (151)","RM OF MORRIS (152)","MUNICIPALITY OF RHINELAND (164)","TOWN OF ALTONA (400)","RM OF PINEY (610)","RM OF STUARTBURN (612)",0,0,0,0,0,0,0,0,0,0,0,0,0,0,null,null,null,null,null,null,null,null,null,null,null,null,null,null,null,null,null,null,null,null,null,null,null,null,null,null,null,null,null,null,null,null,296496,3309489,224012,1859585,54615,5236766,2833433,982143,1040502,0,0,0,0,0,0,0,0,0,0,0,0,0,null,null,null,null,null,null,null,null,null,null,null,null,null,null,null,null,null,null,null,null,null,null,null,null,null,null,null,null,null,null,null,null,null,{"$f":"+BG10-SUM(DL10:FN10)","v":0},1109209,"BO",null,-15736271,-15736271,"BO"]
{"$rows_left_out":308}
{"sheet":"User Instructions","index":1,"n_rows":61,"n_cols":5,"rows_kept":61,"cut":false,"hidden":false,"merged":[[34,1,36,4],[50,1,51,4],[53,0,55,0],[60,0,64,0],[60,1,67,4],[53,1,58,4],[0,1,0,4],[10,1,10,4],[2,1,4,4],[6,1,7,4],[12,1,14,4],[17,1,18,4],[21,1,22,4],[25,1,25,4],[27,0,28,0],[27,1,29,4]]}
[null,"WHO SHOULD USE THIS FORM"]
[]
[null,"School Divisions who have la Division scolaire franco-manitobaine (DSFM) pupils residing in their divisions should use this form to calculate DSFM's portion of Special Levy payments received from municipalities."]
[]
[]
[]
[null,"Payment of the calculated amount from this form should be remitted to DSFM within five (5) working days as set out by the Public School Act Regulation 371/88 Section 3.1(1)."]
[]
[]
[]
{"$rows_left_out":52}
{"sheet":"DATA ENTRY","index":2,"n_rows":161,"n_cols":42,"rows_kept":161,"cut":false,"hidden":false,"merged":[[32,19,33,19],[0,0,0,1],[79,0,79,1],[31,0,33,0],[31,2,33,2],[31,3,33,3],[31,1,33,1],[31,5,33,5],[64,0,64,3],[66,0,66,3],[31,4,33,4]]}
[{"$f":"IF(DIVNUM=1,\"\",VLOOKUP(DIVNUM,LOOKUPTABLE,2))","v":""},null,{"$f":"IF(A101=1,C116,C117)","v":"Calculation of Special Levy Remittances to la Division scolaire franco-manitobaine (DSFM)"},null,null,null,null,null,null,null,null,null,null,null,null,null,null,null,null,null,null,null,null,null,null,0,null,null,null,null,null,null,null,null,null,null,null,null,null,2,{"$f":"IF(DATA!$AI$7=0,1,DATA!$AI$7)","v":1},{"$f":"+AO1-1","v":0}]
[null,null,null,null,null,null,null,null,null,null,null,null,null,null,null,null,null,null,null,null,null,null,null,null,null,null,null,null,null,null,null,null,null,null,null,null,null,null,null,null,"LETTER"]
[]
[]
[]
[]
[null,null,{"$f":"IF($A$101=1,C110,C111)","v":"YEAR OF LEVY "},2024]
[]
[null,null,{"$f":"IF($A$101=1,C113,C114)","v":"SPECIAL LEVY BEFORE TIG (line J.)"},{"$f":"+DATA!$BA$48","v":0},null,"Select the "]
[null,null,{"$f":"IF($A$101=1,C119,C120)","v":"SPECIAL LEVY FOR DSFM (line H.)"},{"$f":"+DATA!$AY$48","v":0},null,"number of"]
{"$rows_left_out":152}
{"sheet":"FORM","index":3,"n_rows":95,"n_cols":15,"rows_kept":95,"cut":false,"hidden":true,"merged":[[0,0,0,9],[27,6,27,12],[28,4,28,5],[28,6,28,7],[4,2,5,6],[7,2,8,3],[14,0,15,4],[17,8,17,10],[14,8,15,10],[13,8,13,10],[10,3,11,5],[92,0,92,12],[41,0,41,2],[45,0,45,2],[45,4,45,5],[41,6,41,7],[42,6,42,7],[41,4,41,5],[42,4,42,5],[65,11,65,12],[78,2,79,3],[43,11,43,12],[42,11,42,12],[44,11,44,12],[45,11,45,12],[43,0,43,2],[46,0,46,2],[44,0,44,2],[43,4,43,5],[54,0,54,2],[49,0,49,2],[47,0,47,2],[48,0,48,2],[53,4,53,5],[49,4,49,5],[30,0,30,3],[31,0,31,3],[30,4,30,5],[30,6,30,7],[33,0,33,3],[31,4,31,5],[35,0,35,3],[14,11,15,11],[18,11,19,11],[22,11,23,11],[24,8,24,10],[22,8,23,10],[16,8,16,10],[18,8,19,10],[28,11,28,12],[41,11,41,12],[30,8,30,10],[40,8,40,10],[32,11,32,12],[29,11,29,12],[22,14,23,14],[25,14,32,14],[10,14,20,14],[44,4,44,5],[40,11,40,12],[30,11,30,12],[31,11,31,12],[41,8,41,10],[26,8,26,10],[25,8,25,10],[32,8,32,10],[39,8,39,10],[39,11,39,12],[38,6,38,12],[39,4,39,5],[39,6,39,7],[51,6,51,7],[40,4,40,5],[29,4,29,5],[40,6,40,7],[43,6,43,7],[46,6,46,7],[45,6,45,7],[20,8,20,10],[50,8,50,10],[49,8,49,10],[42,8,42,10],[43,8,43,10],[44,8,44,10],[28,8,28,10],[45,8,45,10],[48,8,48,10],[21,8,21,10],[47,6,47,7],[47,8,47,10],[48,6,48,7],[48,4,48,5],[49,6,49,7],[44,6,44,7],[46,4,46,5],[59,11,59,12],[60,11,60,12],[62,8,62,10],[59,6,59,7],[64,8,64,10],[60,4,60,5],[59,0,59,2],[57,4,57,5],[57,6,57,7],[57,8,57,10],[57,0,57,2],[58,4,58,5],[58,8,58,10],[58,6,58,7],[58,0,58,2],[70,6,70,7],[70,8,70,10],[60,6,60,7],[60,8,60,10],[74,9,76,9],[79,10,79,11],[78,10,78,11],[66,0,66,2],[71,11,71,12],[70,11,70,12],[66,8,66,10],[66,11,66,12],[70,4,70,5],[74,10,76,11],[74,7,76,8],[63,11,63,12],[64,11,64,12],[64,6,64,7],[62,6,62,7],[68,0,68,3],[67,6,68,7],[67,0,67,3],[62,11,62,12],[65,6,65,7],[87,0,87,1],[57,11,57,12],[54,11,54,12],[51,11,51,12],[52,11,52,12],[53,11,53,12],[47,11,47,12],[48,11,48,12],[55,11,55,12],[58,11,58,12],[61,11,61,12],[60,0,60,2],[56,4,56,5],[56,6,56,7],[61,0,61,2],[61,4,61,5],[59,8,59,10],[61,6,61,7],[61,8,61,10],[77,10,77,11],[49,11,49,12],[50,11,50,12],[56,11,56,12],[56,8,56,10],[74,14,76,14],[67,8,68,10],[67,11,68,12],[74,6,76,6],[32,4,32,5],[32,6,32,7],[63,6,63,7],[63,8,63,10],[59,4,59,5],[72,4,72,5],[33,8,34,10],[51,8,51,10],[50,6,50,7],[46,8,46,10],[55,4,55,5],[54,8,54,10],[52,6,52,7],[53,8,53,10],[52,8,52,10],[55,8,55,10],[55,6,55,7],[63,4,63,5],[64,4,64,5],[62,4,62,5],[65,8,65,10],[67,4,68,5],[66,6,66,7],[66,4,66,5],[65,4,65,5],[56,0,56,2],[29,6,29,7],[29,8,29,10],[31,6,31,7],[31,8,31,10],[55,0,55,2],[64,0,64,2],[62,0,62,2],[50,0,50,2],[47,4,47,5],[50,4,50,5],[51,4,51,5],[54,6,54,7],[53,0,53,2],[54,4,54,5],[53,6,53,7],[52,4,52,5],[52,0,52,2],[51,0,51,2],[94,0,94,9],[33,11,34,12],[35,4,36,5],[35,6,36,7],[35,8,36,10],[35,11,36,12],[34,0,34,3],[33,4,34,5],[33,6,34,7],[36,0,36,3],[87,3,87,7],[63,0,63,2],[71,4,71,5],[77,7,77,8],[65,0,65,2],[46,11,46,12],[88,3,88,7],[70,0,70,3],[88,0,88,1],[76,0,76,4],[74,5,76,5],[74,0,74,4],[75,0,75,4],[78,7,78,8]]}
[]
["Calculation of Amount Remitted to la Division scolaire franco-manitobaine"]
["Calcul du montant remis à la Division scolaire franco-manitobaine"]
[]
["School Division:",null,{"$f":"IF(VLOOKUP(DIVNUM,LOOKUPTABLE,2)=\"Press arrow for your School Division >\",\"\",VLOOKUP(DIVNUM,LOOKUPTABLE,2))","v":""}]
["Division scolaire :"]
[]
["Year of Levy:",null,{"$f":"LEVYYEAR","v":2024}]
["Année de la taxe :"]
[]
{"$rows_left_out":86}
{"sheet":"Changes","index":4,"n_rows":18,"n_cols":2,"rows_kept":18,"cut":false,"hidden":true,"merged":[]}
[]
[null,"Changes in"]
[null,"Data Entry Sheet"]
[1," added a row of TOTAL in Row 42"]
[2," added 2 columns (Column M of YEAR TO DATE COLLECTION and column N of BALANCE TO COLLECT)"]
[3,"In Column D 17: D 40 there is a Hide messege of Error (If the sum of the amounts in the PERIODS Cells is/are bigger than the TOTAL)"]
[4,"Maked the EPTC and the TIG the same way as the other entries."]
[5,"There is no needed to put Zero before the amounts in the AMOUNTS COLLECTED the formula works no matter."]
[6,"The TIG in the row 16 it fills automatically"]
[7,"Added 2 columns for Special Levy and EPTC"]
{"$rows_left_out":8}