{"text_format":"1","workbook":"xlsx","n_sheets":17,"sheets":["CONTROL","Contents","Legislation","INSTRUCTIONS","Auditor Rpt","Management Letter","Enrolment Report","Statement of Financial Position","Surplus","Statement of Operations","Expenditures","Special Ed","Allowable","Personnel","Notes","Notes (2)","Code"],"not_rendered":{"charts":0,"images":4,"macros":1,"external_links":1,"defined_names":541,"comments":1,"pivot_tables":0},"unopened":[],"bounds":{"document_bytes":16777216,"sheet_cells":100000,"rows_first":2000,"rows_last":500,"rows_between":2000,"halvings":0,"cell_chars":16384,"cell_head_chars":4096},"cells_cut":0,"cells_raw":0,"read":"whole","date_system":"1900"}

{"sheet":"CONTROL","index":0,"n_rows":66,"n_cols":31,"rows_kept":66,"cut":false,"hidden":false,"merged":[[30,2,34,5],[9,1,9,2],[36,2,39,5],[3,1,3,5],[1,1,1,5],[9,3,9,5],[12,3,12,5]]}
[null,null,null,null,null,null,null,null,null,null,null,null,null,null,null,null,null,null,null,null,null,null,null,null,{"$f":"VLOOKUP(Code!G3,Y2:Y65,3,FALSE)","v":{"$error":"#N/A"}},null,null,null,null,null,6]
[null,"INDEPENDENT SCHOOL FRAME FINANCIAL STATEMENT"]
[null,null,null,null,null,null,null,null,null,null,null,null,null,null,null,null,null,null,null,null,null,null,null,null,"2221"]
[null,"CONTROL WORKSHEET AND PRINTING ",null,null,null,null,null,null,null,null,null,null,null,null,null,null,null,null,null,null,null,null,null,null,"2114"]
[null,null,null,null,null,null,null,null,null,null,null,null,null,null,null,null,null,null,null,null,null,null,null,null,"1733"]
[null,null,"Choose school here > ",null,null,null,null,null,null,null,null,null,null,null,null,null,null,null,null,null,null,null,null,null,"1536"]
[]
[null,null,"School #",{"$f":"+Code!H3","v":2338}]
[null,null,null,null,null,null,null,null,null,null,null,null,null,null,null,null,null,null,null,null,null,null,null,null,"2102"]
[null,"Correct the name, if you need here >",null,{"$f":"IF(D8=\"\",\"\",+Code!I79)","v":"Western Canada Hockey Academy"},null,null,null,null,null,null,null,null,null,null,null,null,null,null,null,null,null,null,null,null,"1077"]
{"$rows_left_out":57}
{"sheet":"Contents","index":1,"n_rows":17,"n_cols":4,"rows_kept":17,"cut":false,"hidden":false,"merged":[]}
[null,{"$f":"SCHOOLNAME","v":"Western Canada Hockey Academy"}]
[null,"AUDITOR'S REPORT AND FINANCIAL STATEMENTS"]
[null,"TABLE OF CONTENTS"]
[null,null,null,"PAGE"]
[null,null,"LEGISLATIVE AUTHORITY / REQUIREMENTS","i "]
[null,null,"INSTRUCTIONS FOR THE COMPLETION OF THE FINANCIAL STATEMENTS","ii "]
[null,null,"AUDITOR'S REPORT",1]
[null,null,"AUDITOR'S SUPPLEMENTARY REPORT",2]
[null,null,"OPERATING FUND"]
[null,null,"     STATEMENT OF FINANCIAL POSITION",3]
{"$rows_left_out":8}
{"sheet":"Legislation","index":2,"n_rows":61,"n_cols":54,"rows_kept":61,"cut":false,"hidden":false,"merged":[[40,49,42,50]]}
[null,"Independent Schools"]
[]
[null,"Legislative Authority/Requirements"]
[]
[null,"In accordance with The Private Schools Grants Regulation 61/2012"]
[]
[null,"Auditor "]
[null,"Each year, a private school shall appoint an auditor and advise the minister of the auditor’s name and address. "]
[null,"If the auditor is the same as in the previous year, it is not necessary to advise the minister."]
[]
{"$rows_left_out":52}
{"sheet":"INSTRUCTIONS","index":3,"n_rows":99,"n_cols":2,"rows_kept":99,"cut":false,"hidden":false,"merged":[[26,1,30,1],[20,1,22,1],[13,1,13,2],[15,1,15,2],[17,1,17,2],[18,1,18,2],[18,3,18,4],[11,1,11,2],[5,1,5,2],[6,1,6,2],[7,1,7,2],[8,1,8,2],[9,1,9,2],[12,1,12,2]]}
[]
[null,"TO PRINT, CLICK THE PRINTER ICON ON YOUR TOOLBAR (PRINTS 2 LETTER SIZE PAGES)"]
[]
[null,"INSTRUCTIONS FOR THE COMPLETION AND SUBMISSION OF FINANCIAL STATEMENTS"]
[]
["1)","MACROS: For full functionality, set Excel to allow macros. To do this in Excel 2007 or later versions:"]
[null,"Excel 2007: Click the Microsoft Office Button (upper left corner of your screen)"]
[null,"At the bottom of the pop-up box, click the Excel Options button"]
[null,"Excel 2010: Click the File tab (upper left corner of your screen)"]
[null,"On the bottom of the side menu, click Options"]
{"$rows_left_out":90}
{"sheet":"Auditor Rpt","index":4,"n_rows":44,"n_cols":6,"rows_kept":44,"cut":false,"hidden":false,"merged":[[3,3,4,5],[41,3,41,4],[36,3,36,5],[42,3,42,5],[6,4,6,5],[7,1,7,5],[37,3,37,5],[8,1,35,5]]}
[]
[]
[null,"AUDITOR'S REPORT"]
[null,null,null,{"$f":"IF(ISBLANK(SCHOOLNAME),\"\",SCHOOLNAME)","v":"Western Canada Hockey Academy"}]
[null,"TO THE BOARD OF DIRECTORS OF "]
[]
[null,"We have audited the Operating Fund Balance Sheet of "]
[null,{"$f":"D4","v":"Western Canada Hockey Academy"}]
[]
[]
{"$rows_left_out":35}
{"sheet":"Management Letter","index":5,"n_rows":4,"n_cols":3,"rows_kept":4,"cut":false,"hidden":false,"merged":[[1,1,1,5],[3,2,3,4],[5,1,38,4]]}
[]
[null,"AUDITOR'S SUPPLEMENTARY REPORT"]
[null,"MANAGEMENT LETTER"]
[null,"To The Board of ",{"$f":"IF(ISBLANK(SCHOOLNAME),\"\",SCHOOLNAME)","v":"Western Canada Hockey Academy"}]

{"sheet":"Enrolment Report","index":6,"n_rows":39,"n_cols":4,"rows_kept":39,"cut":false,"hidden":false,"merged":[[2,1,2,3],[19,1,19,3],[32,1,32,3],[5,2,5,3],[9,2,9,3]]}
[null,{"$f":"SCHOOLNAME","v":"Western Canada Hockey Academy"}]
[null,"AUDITOR'S SUPPLEMENTARY REPORT"]
[null,"AUDITOR'S  REPORT ON ENROLMENT"]
[null,null,null,{"$f":"\"at \"&Enryr","v":"at September 29, 2023"}]
[]
[null,"To the Board of ",{"$f":"IF(ISBLANK(SCHOOLNAME),\"\",SCHOOLNAME)","v":"Western Canada Hockey Academy"}]
[]
[null,"We have audited the EIS Certification and Enrolment Report (IS EIS CERT-PART 2 OF 2) prepared in "]
[null,"accordance  with Part1, Section 1.1 of the Independent Schools Funding Reporting Requirements for the "]
[null,{"$f":"\"school year \"&SCHYR&\" \"&\"of  the\"","v":"school year 2023/2024 of  the"},{"$f":"IF(ISBLANK(SCHOOLNAME),\"\",SCHOOLNAME)","v":"Western Canada Hockey Academy"}]
{"$rows_left_out":30}
{"sheet":"Statement of Financial Position","index":7,"n_rows":38,"n_cols":8,"rows_kept":38,"cut":false,"hidden":false,"merged":[[32,2,32,3],[33,2,33,3],[34,2,34,3],[12,2,12,3],[13,2,13,3],[14,2,14,3],[20,2,20,3]]}
[null,{"$f":"IF(ISBLANK(SCHOOLNAME),\"\",SCHOOLNAME)","v":"Western Canada Hockey Academy"},null,null,null,null,null,{"$f":"IF(DATE=0,\"\",DATE)","v":"2024-07-18T14:44:41.570"}]
[]
[null,"OPERATING FUND - STATEMENT OF FINANCIAL POSITION"]
[null,{"$f":"\"As at \"&YrEnded&\" \"&THISYR","v":"As at June 30, 2024"}]
[null," ASSETS"]
[null," Cash",null,null,null,null,null,0]
[null," Investments",null,null,null,null,null,0]
[null," Accounts Receivable"]
[null,null,"Provincial Government",null,null,0]
[null,null,"Federal Government",null,null,0]
{"$rows_left_out":29}
{"sheet":"Surplus","index":8,"n_rows":13,"n_cols":8,"rows_kept":13,"cut":false,"hidden":false,"merged":[[8,2,8,3],[9,2,9,3],[10,2,10,3],[11,2,11,3]]}
[null,{"$f":"IF(ISBLANK(SCHOOLNAME),\"\",SCHOOLNAME)","v":"Western Canada Hockey Academy"},null,null,null,null,null,{"$f":"IF(DATE=0,\"\",DATE)","v":"2024-07-18T14:44:41.570"}]
[null,"OPERATING FUND"]
[null,"STATEMENT OF SURPLUS (DEFICIT)"]
[null,{"$f":"ForYr","v":"For the Year Ended June 30, 2024"}]
[]
[null,{"$f":"\" Accumulated Surplus (Deficit), June 30, \"&LASTYR","v":" Accumulated Surplus (Deficit), June 30, 2023"},null,null,null,null,null,0]
[null," Add: Net Current Year Surplus (Deficit)",null,null,null,null,null,{"$f":"NETSURPLUS","v":0}]
[null," Adjustments Affecting Prior Year(s)"]
[null,null,null,null,null,0]
[null,null,null,null,null,0]
{"$rows_left_out":4}
{"sheet":"Statement of Operations","index":9,"n_rows":41,"n_cols":8,"rows_kept":41,"cut":false,"hidden":false,"merged":[]}
[null,{"$f":"IF(ISBLANK(SCHOOLNAME),\"\",SCHOOLNAME)","v":"Western Canada Hockey Academy"},null,null,null,null,null,{"$f":"IF(DATE=0,\"\",DATE)","v":"2024-07-18T14:44:41.570"}]
[]
[null,"OPERATING FUND"]
[null,"STATEMENT OF OPERATIONS"]
[null,{"$f":"ForYr","v":"For the Year Ended June 30, 2024"}]
[]
[null," REVENUES"]
[null,null,"Provincial Government"]
[null,null,"  Department of Education"]
[null,null,null,"Instruction and Services",null,{"$f":"IF(OR(+Allowable!H26=0,+Allowable!H26=\"\"),0,+Allowable!H26)","v":0}]
{"$rows_left_out":32}
{"sheet":"Expenditures","index":10,"n_rows":46,"n_cols":11,"rows_kept":46,"cut":false,"hidden":false,"merged":[[2,4,3,5],[22,10,23,10]]}
[{"$f":"IF(ISBLANK(SCHOOLNAME),\"\",SCHOOLNAME)","v":"Western Canada Hockey Academy"},"OPERATING FUND STATEMENT OF EXPENDITURE",null,null,null,null,null,null,null,{"$f":"IF(DATE=0,\"\",DATE)","v":"2024-07-18T14:44:41.570"}]
[null,{"$f":"ForYr","v":"For the Year Ended June 30, 2024"}]
[null,null,"STUDENT",null,"ADMINISTRATION",null,"INSTRUCTIONAL","TRANSPORTATION"]
[null,null,"SUPPORT","PRE-KINDERGARTEN",null,null,"AND PUPIL","/ BOARDING","OPERATIONS"]
[null,"REGULAR","SERVICES","EDUCATION","BOARD OF","SCHOOL","SUPPORT","OF","AND"]
["CODE         OBJECT \\ FUNCTION","INSTRUCTION","(see note)",null,"DIRECTORS","ADMINISTRATION","SERVICES","PUPILS","MAINTENANCE","TOTALS"]
[" 300 SALARIES"]
[" 310   Directors Remuneration",null,null,null,null,null,null,null,null,{"$f":"E8","v":0}]
[" 320   Executive, Managerial and Supervisory",null,{"$f":"IF(_OE2320=0,0,_OE2320)","v":0},null,null,null,null,null,null,{"$f":"SUM(B9:I9)","v":0}]
[" 330   Instructional - Teaching",null,{"$f":"IF(_OE2330=0,0,_OE2330)","v":0},null,null,null,null,null,null,{"$f":"SUM(B10:D10,G10)","v":0}]
{"$rows_left_out":37}
{"sheet":"Special Ed","index":11,"n_rows":36,"n_cols":9,"rows_kept":36,"cut":false,"hidden":false,"merged":[[16,8,18,8]]}
[{"$f":"IF(ISBLANK(SCHOOLNAME),\"\",SCHOOLNAME)","v":"Western Canada Hockey Academy"},"SPECIAL EDUCATION SERVICES EXPENDITURES DETAIL",null,null,null,null,null,{"$f":"IF(DATE=0,\"\",DATE)","v":"2024-07-18T14:44:41.570"}]
[null,{"$f":"ForYr","v":"For the Year Ended June 30, 2024"}]
[{"$f":"IF(AND(OE2TOT>25000,_TOT200=0),\"Error: You Need to complete this worksheet\",\"\")","v":""},"* TO BE COMPLETED BY SCHOOLS WITH TOTAL SPECIAL EDUCATION SERVICES EXPENDITURES GREATER THAN $25,000"]
[null,null,null,"CLINICAL AND",null,null,"OTHER"]
[null,"ADMINISTRATION","GIFTED","RELATED","SPECIAL ","REGULAR","RESOURCE"]
["CODE         OBJECT \\ PROGRAM","/CO-ORDINATION","EDUCATION","SERVICES","PLACEMENT","PLACEMENT","SERVICES","TOTALS"]
[" 300 SALARIES"]
[" 320   Executive, Managerial and Supervisory",null,null,null,null,null,null,{"$f":"SUM(B8,C8,E8)","v":0}]
[" 330   Instructional - Teaching",null,null,null,null,null,null,{"$f":"SUM(C9,E9:G9)","v":0}]
[" 350   Instructional - Other",null,null,null,null,null,null,{"$f":"SUM(C10,E10:G10)","v":0}]
{"$rows_left_out":27}
{"sheet":"Allowable","index":12,"n_rows":58,"n_cols":11,"rows_kept":58,"cut":false,"hidden":false,"merged":[[0,7,0,9],[9,7,9,8],[6,7,6,8],[7,7,7,8],[8,7,8,8],[49,6,49,7],[48,6,48,7],[45,6,45,7],[46,6,46,7],[28,7,28,8],[41,5,41,7],[47,6,47,7],[44,6,44,7],[42,6,42,7],[43,6,43,7]]}
[{"$f":"IF(ISBLANK(SCHOOLNAME),\"\",SCHOOLNAME)","v":"Western Canada Hockey Academy"},null,null,null,null,null,null,{"$f":"IF(DATE=0,\"\",DATE)","v":"2024-07-18T14:44:41.570"}]
[]
["STATEMENT OF ALLOWABLE EXPENDITURES"]
[{"$f":"ForYr","v":"For the Year Ended June 30, 2024"}]
["To be completed by all Independent Schools"]
[]
[null,null,null,null,null,"STUDENT",null,"INSTRUCTION"]
[null,null,null,null,null,"SUPPORT",null,"AND"]
[null,null,null,null,null,"SERVICES",null,"SERVICES"]
[]
{"$rows_left_out":49}
{"sheet":"Personnel","index":13,"n_rows":18,"n_cols":10,"rows_kept":18,"cut":false,"hidden":false,"merged":[[5,3,6,4],[12,9,13,9]]}
[{"$f":"IF(ISBLANK(SCHOOLNAME),\"\",SCHOOLNAME)","v":"Western Canada Hockey Academy"},null,null,null,null,null,null,null,{"$f":"IF(DATE=0,\"\",DATE)","v":"2024-07-18T14:44:41.570"}]
[]
["FULL TIME EQUIVALENT PERSONNEL EMPLOYED (UNAUDITED)"]
[{"$f":"Enryr","v":"September 29, 2023"}]
[]
[null,null,null,"ADMINISTRATION",null,"INSTRUCTION","TRANSPORTATION"]
[null,null,"STUDENT",null,null,"AND PUPIL","/ BOARDING","OPERATIONS"]
[null,"REGULAR","SUPPORT","BOARD OF","SCHOOL","SUPPORT","OF","AND"]
["CODE         OBJECT \\ FUNCTION","INSTRUCTION","SERVICES","DIRECTORS","ADMINISTRATION","SERVICES","PUPILS","MAINTENANCE","TOTALS"]
[" 310   Directors (headcount)",null,null,null,null,null,null,null,{"$f":"D10","v":0}]
{"$rows_left_out":9}
{"sheet":"Notes","index":14,"n_rows":3,"n_cols":2,"rows_kept":3,"cut":false,"hidden":false,"merged":[[3,1,58,3]]}
[null,{"$f":"SCHOOLNAME","v":"Western Canada Hockey Academy"}]
[null,"NOTES TO THE FINANCIAL STATEMENTS"]
[null,{"$f":"ForYr","v":"For the Year Ended June 30, 2024"}]

{"sheet":"Notes (2)","index":15,"n_rows":3,"n_cols":2,"rows_kept":3,"cut":false,"hidden":false,"merged":[[3,1,58,3]]}
[null,{"$f":"SCHOOLNAME","v":"Western Canada Hockey Academy"}]
[null,"NOTES TO THE FINANCIAL STATEMENTS"]
[null,{"$f":"ForYr","v":"For the Year Ended June 30, 2024"}]

{"sheet":"Code","index":16,"n_rows":81,"n_cols":37,"rows_kept":81,"cut":false,"hidden":true,"merged":[[80,9,80,12],[80,13,80,17],[0,25,0,28]]}
[null,{"$f":"NOW()","v":"2024-07-18T14:44:41.570"},null,null,null,null,null,null,{"$f":"+Enryr","v":"September 29, 2023"},"Kdg","total Eligible Enrolment","Level 2","Level3","Preliminar I & S Grant","Total Special needs Col S","Total Curricular materials","Total adjustments","TOTAL GRANT PAID",null,null,null,null,null,null,null,"Enrolment Tab",null,null,null,"Funding Tab"]
[null," DATE:",null,null,null,null,null,null,null,null,null,null,null,null,null,null,null,null,null,null,null,null,null,null,"Source File: PY July support file and last school year payment","Col H","Col S","Col T","Col U",null,"Preliminar I & S Grant","Total Special needs ","Total Curricular materials","Total adjustments","TOTAL GRANT PAID","July 2022 Support File","Check"]
[null,null,null,null,null,"Formulas =>",66,{"$f":"IF(G3=1,\"\",VLOOKUP(G3,G4:I74,2,FALSE))","v":2338},{"$f":"VLOOKUP(G3,G4:I74,3,FALSE)","v":"Western Canada Hockey Academy"},null,null,null,null,null,null,null,null,null,null,null,null,null,null,"School Name",null,"K",{"$f":"+K1","v":"total Eligible Enrolment"},{"$f":"+L1","v":"Level 2"},{"$f":"+M1","v":"Level3"},null,"Column N","Col S","Col O","Col AE","Col AF","Total Grant Paid"]
["ForYr",{"$f":"\"For the Year Ended June 30, \"&FIXED(B7,0,1)","v":"For the Year Ended June 30, 2024"},null,null,null,null,1,null,"Press down arrow for school name =>"]
["ATSEP",{"$f":"\"September 29, \"&FIXED(B6,0,1)","v":"September 29, 2023"},null,null,null,null,{"$f":"+G4+1","v":2},2221,"Academie Islamique",{"$f":"SUMIF($V$5:$V$74,$H5,$Z$5:$Z$74)","v":7},{"$f":"SUMIF($V$5:$V$74,$H5,$AA$5:$AA$74)","v":52.5},{"$f":"SUMIF($V$5:$V$74,$H5,$AB$5:$AB$74)","v":0},{"$f":"SUMIF($V$5:$V$74,$H5,$AC$5:$AC$74)","v":0},{"$f":"SUMIF($AD$5:$AD$74,$H5,$AE$5:$AE$78)","v":339833},{"$f":"SUMIF($AD$5:$AD$74,$H5,$AF$5:$AF$78)","v":0},{"$f":"SUMIF($AD$5:$AD$74,$H5,$AG$5:$AG$78)","v":3150},{"$f":"SUMIF($AD$5:$AD$74,$H5,$AH$5:$AH$74)","v":0},{"$f":"SUMIF($AD$5:$AD$74,$H5,$AI$5:$AI$74)","v":342983},{"$f":"+N5+O5+P5+Q5-R5","v":0},null,null,2221,"LR ","Academie Islamique ","Academie Islamique ",{"$f":"VLOOKUP(V5,[1]enrolment!$B$10:$H$78,7,FALSE)","v":7},{"$f":"VLOOKUP(V5,[1]enrolment!$B$10:$S$78,18,FALSE)","v":52.5},{"$f":"VLOOKUP(V5,[1]enrolment!$B$10:$T$78,19,FALSE)","v":0},{"$f":"VLOOKUP(V5,[1]enrolment!$B$10:$U$78,20,FALSE)","v":0},2221,{"$f":"VLOOKUP(AD5,[1]Funding!$B$10:$N$78,13,FALSE)","v":339833},{"$f":"VLOOKUP(AD5,[1]Funding!$B$10:$S$78,18,FALSE)","v":0},{"$f":"VLOOKUP(AD5,[1]Funding!$B$10:$S$78,14,FALSE)","v":3150},{"$f":"VLOOKUP(AD5,[1]Funding!$B$10:$AE$78,30,FALSE)","v":0},{"$f":"SUM(AE5:AH5)","v":342983},{"$f":"VLOOKUP(AD5,[1]Funding!$B$10:$AF$78,31,FALSE)","v":342983},{"$f":"AI5-AJ5","v":0}]
["LASTYR",{"$f":"+THISYR-1","v":2023},null,null,null,null,3,2114,"Alhijra Islamic School",{"$f":"SUMIF($V$5:$V$74,$H6,$Z$5:$Z$74)","v":26},{"$f":"SUMIF($V$5:$V$74,$H6,$AA$5:$AA$74)","v":265},0,0,1715345,0,15900,0,1731245,{"$f":"+N6+O6+P6+Q6-R6","v":0},null,null,2114,"LR","Alhijra Islamic School","Alhijra Islamic School",{"$f":"VLOOKUP(V6,[1]enrolment!$B$10:$H$78,7,FALSE)","v":26},{"$f":"VLOOKUP(V6,[1]enrolment!$B$10:$S$78,18,FALSE)","v":265},{"$f":"VLOOKUP(V6,[1]enrolment!$B$10:$T$78,19,FALSE)","v":0},{"$f":"VLOOKUP(V6,[1]enrolment!$B$10:$U$78,20,FALSE)","v":0},2114,{"$f":"VLOOKUP(AD6,[1]Funding!$B$10:$N$78,13,FALSE)","v":1715345},{"$f":"VLOOKUP(AD6,[1]Funding!$B$10:$S$78,18,FALSE)","v":0},{"$f":"VLOOKUP(AD6,[1]Funding!$B$10:$S$78,14,FALSE)","v":15900},{"$f":"VLOOKUP(AD6,[1]Funding!$B$10:$AE$78,30,FALSE)","v":0},{"$f":"SUM(AE6:AH6)","v":1731245},{"$f":"VLOOKUP(AD6,[1]Funding!$B$10:$AF$78,31,FALSE)","v":1731245},{"$f":"AI6-AJ6","v":0}]
["THISYR",{"$f":"+YEARINPUT","v":2024},null,null,null,null,4,1733,"Austin Christian Academy",3,55.5,0,1,358336,21076,3330,0,382742,0,null,null,1733,"BE","Austin Christian Academy","Austin Christian Academy Inc",{"$f":"VLOOKUP(V7,[1]enrolment!$B$10:$H$78,7,FALSE)","v":3},{"$f":"VLOOKUP(V7,[1]enrolment!$B$10:$S$78,18,FALSE)","v":55.5},{"$f":"VLOOKUP(V7,[1]enrolment!$B$10:$T$78,19,FALSE)","v":0},{"$f":"VLOOKUP(V7,[1]enrolment!$B$10:$U$78,20,FALSE)","v":1},1733,{"$f":"VLOOKUP(AD7,[1]Funding!$B$10:$N$78,13,FALSE)","v":358336},{"$f":"VLOOKUP(AD7,[1]Funding!$B$10:$S$78,18,FALSE)","v":21076},{"$f":"VLOOKUP(AD7,[1]Funding!$B$10:$S$78,14,FALSE)","v":3330},{"$f":"VLOOKUP(AD7,[1]Funding!$B$10:$AE$78,30,FALSE)","v":0},382742,{"$f":"VLOOKUP(AD7,[1]Funding!$B$10:$AF$78,31,FALSE)","v":382742},0]
["Enryr",{"$f":"\"September 29, \"&FIXED(B6,0,1)","v":"September 29, 2023"},null,null,null,null,5,2336,"Avicenna Academy",18,38,0,0,245974,0,2280,0,248254,0,null,null,2336,"PE","Avicenna Academy","Avicenna Academy",{"$f":"VLOOKUP(V8,[1]enrolment!$B$10:$H$78,7,FALSE)","v":18},{"$f":"VLOOKUP(V8,[1]enrolment!$B$10:$S$78,18,FALSE)","v":38},{"$f":"VLOOKUP(V8,[1]enrolment!$B$10:$T$78,19,FALSE)","v":0},{"$f":"VLOOKUP(V8,[1]enrolment!$B$10:$U$78,20,FALSE)","v":0},2336,{"$f":"VLOOKUP(AD8,[1]Funding!$B$10:$N$78,13,FALSE)","v":245974},{"$f":"VLOOKUP(AD8,[1]Funding!$B$10:$S$78,18,FALSE)","v":0},{"$f":"VLOOKUP(AD8,[1]Funding!$B$10:$S$78,14,FALSE)","v":2280},{"$f":"VLOOKUP(AD8,[1]Funding!$B$10:$AE$78,30,FALSE)","v":0},{"$f":"SUM(AE8:AH8)","v":248254},{"$f":"VLOOKUP(AD8,[1]Funding!$B$10:$AF$78,31,FALSE)","v":248254},{"$f":"AI8-AJ8","v":0}]
["Schyr",{"$f":"+LASTYR&\"/\"&THISYR","v":"2023/2024"},null,null,null,null,6,1536,"Balmoral Hall School",30,415.5,4.5,0,2511145,39900,24930,0,2575975,0,null,null,1536,"WI","Balmoral Hall School","Balmoral Hall School For Girls",{"$f":"VLOOKUP(V9,[1]enrolment!$B$10:$H$78,7,FALSE)","v":30},{"$f":"VLOOKUP(V9,[1]enrolment!$B$10:$S$78,18,FALSE)","v":415.5},{"$f":"VLOOKUP(V9,[1]enrolment!$B$10:$T$78,19,FALSE)","v":4.5},{"$f":"VLOOKUP(V9,[1]enrolment!$B$10:$U$78,20,FALSE)","v":0},1536,{"$f":"VLOOKUP(AD9,[1]Funding!$B$10:$N$78,13,FALSE)","v":2511145},{"$f":"VLOOKUP(AD9,[1]Funding!$B$10:$S$78,18,FALSE)","v":39900},{"$f":"VLOOKUP(AD9,[1]Funding!$B$10:$S$78,14,FALSE)","v":24930},{"$f":"VLOOKUP(AD9,[1]Funding!$B$10:$AE$78,30,FALSE)","v":0},2575975,{"$f":"VLOOKUP(AD9,[1]Funding!$B$10:$AF$78,31,FALSE)","v":2575975},{"$f":"AI9-AJ9","v":0}]
[null,null,null,null,null,null,7,2102,"Beautiful Savior Lutheran School",12,93,4,1.5,601989,69695,5580,0,677264,0,null,null,2102,"LR","Beautiful Savior Lutheran School","Beautiful Savior Lutheran School Inc",{"$f":"VLOOKUP(V10,[1]enrolment!$B$10:$H$78,7,FALSE)","v":12},{"$f":"VLOOKUP(V10,[1]enrolment!$B$10:$S$78,18,FALSE)","v":93},{"$f":"VLOOKUP(V10,[1]enrolment!$B$10:$T$78,19,FALSE)","v":4},{"$f":"VLOOKUP(V10,[1]enrolment!$B$10:$U$78,20,FALSE)","v":1.5},2102,{"$f":"VLOOKUP(AD10,[1]Funding!$B$10:$N$78,13,FALSE)","v":601989},{"$f":"VLOOKUP(AD10,[1]Funding!$B$10:$S$78,18,FALSE)","v":69695},{"$f":"VLOOKUP(AD10,[1]Funding!$B$10:$S$78,14,FALSE)","v":5580},{"$f":"VLOOKUP(AD10,[1]Funding!$B$10:$AE$78,30,FALSE)","v":0},677264,{"$f":"VLOOKUP(AD10,[1]Funding!$B$10:$AF$78,31,FALSE)","v":677264},0]
{"$rows_left_out":71}